Target
5-hydroxytryptamine receptor 2A
Ligand
BDBM50182751
Substrate
Meas. Tech.
ChEMBL_1586509 (CHEMBL3821448)
Ki
523±n/a nM
Citation
 Ofori, EZhu, XYEtukala, JRPeprah, KJordan, KRAdkins, AABricker, BAKang, HJHuang, XPRoth, BLAblordeppey, SY Design and synthesis of dual 5-HT1A and 5-HT7 receptor ligands. Bioorg Med Chem 24:3464-71 (2016)  
Target
Name:
5-hydroxytryptamine receptor 2A
Synonyms:
5-HT-2 5-HT2A 5-hydroxytryptamine receptor 2A (5HT-2A) 5HT2A_HUMAN HTR2A | Serotonin receptor 2A
Type:
undefined
Mol. Mass.:
52607.65
Organism:
Homo sapiens (Human)
Description:
P28223
Residue:
471
  
Inhibitor
Name:
BDBM50182751
Synonyms:
CHEMBL3819082
Type:
Small organic molecule
Emp. Form.:
C20H23ClFN
Mol. Mass.:
331.855
SMILES:
Cl.Fc1ccc2CC(CCN3CCc4ccccc4C3)Cc2c1
: