Target
D(4) dopamine receptor
Ligand
BDBM21397
Substrate
Meas. Tech.
ChEMBL_1586234 (CHEMBL3820052)
Ki
1.4±n/a nM
Citation
 Etukala, JRZhu, XYEyunni, SVOnyameh, EKOfori, EBricker, BAKang, HJHuang, XPRoth, BLAblordeppey, SY Development of CNS multi-receptor ligands: Modification of known D2 pharmacophores. Bioorg Med Chem 24:3671-9 (2016)  
Target
Name:
D(4) dopamine receptor
Synonyms:
D(2C) dopamine receptor DOPAMINE D4.2 DRD4 Dopamine D4 receptor
Type:
Enzyme
Mol. Mass.:
48373.19
Organism:
Homo sapiens (Human)
Description:
P21917
Residue:
419
  
Inhibitor
Name:
BDBM21397
Synonyms:
8-[4-(4-fluorophenyl)-4-keto-butyl]-1-phenyl-1,3,8-triazaspiro[4.5]decan-4-one 8-[4-(4-fluorophenyl)-4-oxobutyl]-1-phenyl-1,3,8-triazaspiro[4.5]decan-4-one MLS000028615 SPIPERONE US9359372, Spiperone cid_5265
Type:
radiolabeled ligand
Emp. Form.:
C23H26FN3O2
Mol. Mass.:
395.4698
SMILES:
Fc1ccc(cc1)C(=O)CCCN1CCC2(CC1)N(CNC2=O)c1ccccc1
: