Target
Neurotensin receptor type 2
Ligand
BDBM50183343
Substrate
Meas. Tech.
ChEMBL_1586259 (CHEMBL3820077)
EC50
345±n/a nM
Citation
 Narayanan, SMaitra, RDeschamps, JRBortoff, KThomas, JBZhang, YWarner, KVasukuttan, VDecker, ARunyon, SP Discovery of a novel small molecule agonist scaffold for the APJ receptor. Bioorg Med Chem 24:3758-70 (2016)  
Target
Name:
Neurotensin receptor type 2
Synonyms:
High-affinity levocabastine-sensitive neurotensin receptor NTR2_RAT Neurotensin receptor type 2 Ntsr2
Type:
PROTEIN
Mol. Mass.:
46280.50
Organism:
Rattus norvegicus
Description:
ChEMBL_1466615
Residue:
416
  
Inhibitor
Name:
BDBM50183343
Synonyms:
CHEMBL3818506
Type:
Small organic molecule
Emp. Form.:
C27H30FN3O5
Mol. Mass.:
495.5426
SMILES:
COc1cccc(OC)c1-c1cc(nn1-c1ccc(F)cc1)C(=O)N[C@H](CC(O)=O)C1CCCCC1
: