Target
Apelin receptor
Ligand
BDBM50183341
Substrate
Meas. Tech.
ChEMBL_1586260 (CHEMBL3820078)
Ki
1300±n/a nM
Citation
 Narayanan, SMaitra, RDeschamps, JRBortoff, KThomas, JBZhang, YWarner, KVasukuttan, VDecker, ARunyon, SP Discovery of a novel small molecule agonist scaffold for the APJ receptor. Bioorg Med Chem 24:3758-70 (2016)  
Target
Name:
Apelin receptor
Synonyms:
AGTRL1 APJ_HUMAN Angiotensin receptor-like 1 Apelin receptor (APJ) G-protein coupled receptor HG11
Type:
Enzyme Catalytic Domain
Mol. Mass.:
42664.06
Organism:
Homo sapiens (Human)
Description:
P35414
Residue:
380
  
Inhibitor
Name:
BDBM50183341
Synonyms:
CHEMBL3817879
Type:
Small organic molecule
Emp. Form.:
C29H34FN3O5
Mol. Mass.:
523.5958
SMILES:
COc1cccc(OC)c1-c1cc(nn1-c1ccc(F)cc1)C(=O)N[C@@H](CCC1CCCCC1)CC(O)=O
: