Target
Heat shock cognate 71 kDa protein
Ligand
BDBM32370
Substrate
Meas. Tech.
ChEMBL_1588265 (CHEMBL3825930)
Kd
6918±n/a nM
Citation
 Cheeseman, MDWestwood, IMBarbeau, ORowlands, MDobson, SJones, AMJeganathan, FBurke, RKadi, NWorkman, PCollins, Ivan Montfort, RLJones, K Exploiting Protein Conformational Change to Optimize Adenosine-Derived Inhibitors of HSP70. J Med Chem 59:4625-36 (2016)  
Target
Name:
Heat shock cognate 71 kDa protein
Synonyms:
HSC70 HSP7C_HUMAN HSPA8 heat shock 70kDa protein 8 isoform 2
Type:
Enzyme Catalytic Domain
Mol. Mass.:
70887.67
Organism:
Homo sapiens (Human)
Description:
gi_5729877
Residue:
646
  
Inhibitor
Name:
BDBM32370
Synonyms:
adenosine-derived inhibitor (Grp78), 2 | adenosine-derived inhibitor, 4
Type:
Small organic molecule
Emp. Form.:
C10H14N6O4
Mol. Mass.:
282.256
SMILES:
Nc1nc2c(N)ncnc2n1[C@@H]1O[C@H](CO)[C@@H](O)[C@H]1O
: