Target
Acetylcholinesterase
Ligand
BDBM50185007
Substrate
Meas. Tech.
ChEMBL_1588986 (CHEMBL3825027)
Ki
14±n/a nM
Citation
 García-Font, NHayour, HBelfaitah, APedraz, JMoraleda, IIriepa, IBouraiou, AChioua, MMarco-Contelles, JOset-Gasque, MJ Potent anticholinesterasic and neuroprotective pyranotacrines as inhibitors of beta-amyloid aggregation, oxidative stress and tau-phosphorylation for Alzheimer's disease. Eur J Med Chem 118:178-92 (2016)  
Target
Name:
Acetylcholinesterase
Synonyms:
ACES_ELEEL Acetylcholinesterase (EeAChE) | ache
Type:
Enzyme
Mol. Mass.:
71812.79
Organism:
Electrophorus electricus (Electric eel)
Description:
Residue:
633
  
Inhibitor
Name:
BDBM50185007
Synonyms:
CHEMBL3822686
Type:
Small organic molecule
Emp. Form.:
C25H24ClN3O4
Mol. Mass.:
465.929
SMILES:
COC(=O)C1=C(C)Oc2nc3CCCCc3c(N)c2C1c1cc2ccc(OC)cc2nc1Cl
: