Target
Carbonic anhydrase 9
Ligand
BDBM50185300
Substrate
Meas. Tech.
ChEMBL_1587515 (CHEMBL3825324)
Ki
9.6±n/a nM
Citation
 Akocak, SAlam, MRShabana, AMSanku, RKVullo, DThompson, HSwenson, ERSupuran, CTIlies, MA PEGylated Bis-Sulfonamide Carbonic Anhydrase Inhibitors Can Efficiently Control the Growth of Several Carbonic Anhydrase IX-Expressing Carcinomas. J Med Chem 59:5077-88 (2016)  
Target
Name:
Carbonic anhydrase 9
Synonyms:
CA-IX CAH9_HUMAN Carbonic anhydrase 9 (CA IX) Carbonic anhydrase 9 precursor Carbonic anhydrase IX (CAIX) Carbonic anhydrases; II & IX MN RCC-associated antigen G250
Type:
Enzyme
Mol. Mass.:
49669.03
Organism:
Homo sapiens (Human)
Description:
Catalytic domain of human cloned isozyme was used in the assay
Residue:
459
  
Inhibitor
Name:
BDBM50185300
Synonyms:
CHEMBL3822486
Type:
Small organic molecule
Emp. Form.:
C18H28N10O10S4
Mol. Mass.:
672.736
SMILES:
NS(=O)(=O)c1nnc(NC(=O)CCC(=O)NCCOCCOCCNC(=O)CCC(=O)Nc2nnc(s2)S(N)(=O)=O)s1
: