Target
Carbonic anhydrase 12
Ligand
BDBM50185299
Substrate
Meas. Tech.
ChEMBL_1587516 (CHEMBL3825325)
Ki
2.8±n/a nM
Citation
 Akocak, SAlam, MRShabana, AMSanku, RKVullo, DThompson, HSwenson, ERSupuran, CTIlies, MA PEGylated Bis-Sulfonamide Carbonic Anhydrase Inhibitors Can Efficiently Control the Growth of Several Carbonic Anhydrase IX-Expressing Carcinomas. J Med Chem 59:5077-88 (2016)  
Target
Name:
Carbonic anhydrase 12
Synonyms:
CA-XII CAH12_HUMAN Carbonic anhydrase Carbonic anhydrase XII Carbonic anhydrase XII (CAXII) | Tumor antigen HOM-RCC-3.1.3
Type:
Enzyme
Mol. Mass.:
39456.00
Organism:
Homo sapiens (Human)
Description:
Catalytic domain of human cloned isozyme was used in the assay
Residue:
354
  
Inhibitor
Name:
BDBM50185299
Synonyms:
CHEMBL3823200
Type:
Small organic molecule
Emp. Form.:
C30H38N12O14S6
Mol. Mass.:
983.085
SMILES:
NS(=O)(=O)c1nnc(NS(=O)(=O)c2ccc(NC(=O)CCC(=O)NCCOCCOCCNC(=O)CCC(=O)Nc3ccc(cc3)S(=O)(=O)Nc3nnc(s3)S(N)(=O)=O)cc2)s1
: