Target
Maternal embryonic leucine zipper kinase
Ligand
BDBM50185445
Substrate
Meas. Tech.
ChEMBL_1588028 (CHEMBL3824963)
IC50
36±n/a nM
Citation
 Touré, BBGiraldes, JSmith, TSprague, ERWang, YMathieu, SChen, ZMishina, YFeng, YYan-Neale, YShakya, SChen, DMeyer, MPuleo, DBrazell, JTStraub, CSage, DWright, KYuan, YChen, XDuca, JKim, STian, LMartin, EHurov, KShao, W Toward the Validation of Maternal Embryonic Leucine Zipper Kinase: Discovery, Optimization of Highly Potent and Selective Inhibitors, and Preliminary Biology Insight. J Med Chem 59:4711-23 (2016)  
Target
Name:
Maternal embryonic leucine zipper kinase
Synonyms:
KIAA0175 MELK_HUMAN Maternal embryonic leucine zipper kinase (MELK)
Type:
Enzyme
Mol. Mass.:
74665.45
Organism:
Homo sapiens (Human)
Description:
Q14680
Residue:
651
  
Inhibitor
Name:
BDBM50185445
Synonyms:
CHEMBL3824074
Type:
Small organic molecule
Emp. Form.:
C20H22N4O
Mol. Mass.:
334.4149
SMILES:
C(Oc1cnccc1-c1cnn(c1)-c1ccccc1)C1CCNCC1
: