Target
Maternal embryonic leucine zipper kinase
Ligand
BDBM50185440
Substrate
Meas. Tech.
ChEMBL_1588028 (CHEMBL3824963)
IC50
80±n/a nM
Citation
 Touré, BBGiraldes, JSmith, TSprague, ERWang, YMathieu, SChen, ZMishina, YFeng, YYan-Neale, YShakya, SChen, DMeyer, MPuleo, DBrazell, JTStraub, CSage, DWright, KYuan, YChen, XDuca, JKim, STian, LMartin, EHurov, KShao, W Toward the Validation of Maternal Embryonic Leucine Zipper Kinase: Discovery, Optimization of Highly Potent and Selective Inhibitors, and Preliminary Biology Insight. J Med Chem 59:4711-23 (2016)  
Target
Name:
Maternal embryonic leucine zipper kinase
Synonyms:
KIAA0175 MELK_HUMAN Maternal embryonic leucine zipper kinase (MELK)
Type:
Enzyme
Mol. Mass.:
74665.45
Organism:
Homo sapiens (Human)
Description:
Q14680
Residue:
651
  
Inhibitor
Name:
BDBM50185440
Synonyms:
CHEMBL3823597
Type:
Small organic molecule
Emp. Form.:
C19H21N5
Mol. Mass.:
319.4035
SMILES:
CN1CCN(CC1)c1ccc(cc1)-n1cc(cn1)-c1ccncc1
: