Target
Hepatocyte growth factor receptor
Ligand
BDBM50185612
Substrate
Meas. Tech.
ChEMBL_1588142 (CHEMBL3825518)
IC50
8200±n/a nM
Citation
 Mohyeldin, MMBusnena, BAAkl, MRDragoi, AMCardelli, JAEl Sayed, KA Novel c-Met inhibitory olive secoiridoid semisynthetic analogs for the control of invasive breast cancer. Eur J Med Chem 118:299-315 (2016)  
Target
Name:
Hepatocyte growth factor receptor
Synonyms:
Hepatocyte growth factor receptor Hepatocyte growth factor receptor (c-MET) MET Met proto-oncogene (hepatocyte growth factor receptor) Tyrosine-protein kinase Met (c-Met) c-Met kinase
Type:
Protein
Mol. Mass.:
155559.73
Organism:
Homo sapiens (Human)
Description:
P08581
Residue:
1390
  
Inhibitor
Name:
BDBM50185612
Synonyms:
CHEMBL3824063
Type:
Small organic molecule
Emp. Form.:
C19H20O5
Mol. Mass.:
328.3591
SMILES:
COc1cc(\C=C\C(=O)OCCCc2ccc(O)cc2)ccc1O
: