Target
Ectonucleotide pyrophosphatase/phosphodiesterase family member 2
Ligand
BDBM50187695
Substrate
Meas. Tech.
ChEMBL_1591116 (CHEMBL3829084)
Ki
390±n/a nM
Citation
 Castagna, DBudd, DCMacdonald, SJJamieson, CWatson, AJ Development of Autotaxin Inhibitors: An Overview of the Patent and Primary Literature. J Med Chem 59:5604-21 (2016)  
Target
Name:
Ectonucleotide pyrophosphatase/phosphodiesterase family member 2
Synonyms:
ATX Autotaxin (ATX) ENPP2 Ectonucleotide Pyrophosphatase/Phosphodiesterase 2 (ENPP2) Extracellular lysophospholipase D PDNP2
Type:
Enzyme
Mol. Mass.:
99007.13
Organism:
Homo sapiens (Human)
Description:
Q13822
Residue:
863
  
Inhibitor
Name:
BDBM50187695
Synonyms:
CHEMBL1632521
Type:
Small organic molecule
Emp. Form.:
C35H57N2O7P
Mol. Mass.:
648.81
SMILES:
CCCCCCCCCCCCCCCC(=O)N[C@@H](Cc1ccc(OCc2ncc(C)c(OC)c2C)cc1)[C@@H](O)CP(O)(O)=O
: