Target
Aromatase
Ligand
BDBM23419
Substrate
Meas. Tech.
ChEMBL_1589888 (CHEMBL3830768)
IC50
1000±n/a nM
Citation
 Dandriyal, JSingla, RKumar, MJaitak, V Recent developments of C-4 substituted coumarin derivatives as anticancer agents. Eur J Med Chem 119:141-68 (2016)  
Target
Name:
Aromatase
Synonyms:
ARO1 CP19A_HUMAN CYP19 CYPXIX Cytochrome P450 19A1 Cytochrome P450-C19 (CYP19) FL cytokine receptor precursor | P-450AROM
Type:
Enzyme
Mol. Mass.:
57888.92
Organism:
Homo sapiens (Human)
Description:
P11511
Residue:
503
  
Inhibitor
Name:
BDBM23419
Synonyms:
(2S)-5,7-dihydroxy-2-(4-hydroxyphenyl)-3,4-dihydro-2H-1-benzopyran-4-one Naringenin
Type:
flavanone
Emp. Form.:
C15H12O5
Mol. Mass.:
272.2528
SMILES:
Oc1ccc(cc1)[C@@H]1CC(=O)c2c(O)cc(O)cc2O1
: