Target
Poly [ADP-ribose] polymerase tankyrase-2
Ligand
BDBM50005187
Substrate
Meas. Tech.
ChEMBL_1589940 (CHEMBL3830930)
IC50
43±n/a nM
Citation
 Nathubhai, AHaikarainen, THayward, PCMuñoz-Descalzo, SThompson, ASLloyd, MDLehtiö, LThreadgill, MD Structure-activity relationships of 2-arylquinazolin-4-ones as highly selective and potent inhibitors of the tankyrases. Eur J Med Chem 118:316-27 (2016)  
Target
Name:
Poly [ADP-ribose] polymerase tankyrase-2
Synonyms:
(ARTD6 or PARP5b) Poly [ADP-ribose] polymerase tankyrase-2 TNKL TNKS2_HUMAN Tankyrase 2 Tankyrase-2 Tankyrase-2 (TNKS2)
Type:
Enzyme
Mol. Mass.:
126937.16
Organism:
Homo sapiens (Human)
Description:
Q9H2K2
Residue:
1166
  
Inhibitor
Name:
BDBM50005187
Synonyms:
CHEMBL3099815
Type:
Small organic molecule
Emp. Form.:
C16H15N3O
Mol. Mass.:
265.3098
SMILES:
Cc1cccc2c1nc([nH]c2=O)-c1ccc(CN)cc1
: