Target
Histone deacetylase 3/Nuclear receptor corepressor 2 (HDAC3/NCoR2)
Ligand
BDBM29589
Substrate
Meas. Tech.
ChEMBL_1590564 (CHEMBL3829033)
IC50
2.3±n/a nM
Citation
 Chen, YWang, XXiang, WHe, LTang, MWang, FWang, TYang, ZYi, YWang, HNiu, TZheng, LLei, LLi, XSong, HChen, L Development of Purine-Based Hydroxamic Acid Derivatives: Potent Histone Deacetylase Inhibitors with Marked in Vitro and in Vivo Antitumor Activities. J Med Chem 59:5488-504 (2016)  
Target
Name:
Histone deacetylase 3/Nuclear receptor corepressor 2 (HDAC3/NCoR2)
Synonyms:
HDAC3/NcoR2 Complex | Histone deacetylase 3/Nuclear receptor corepressor 2
Type:
Mol. Mass.:
Description:
ASSAY_ID of ChEMBL is 2146499
Components:
This complex has 2 components.
Component 1
Name:
Histone deacetylase 3
Synonyms:
HD3 HDAC3_HUMAN Human HDAC3 SMAP45
Type:
Enzyme
Mol. Mass.:
48829.55
Organism:
Homo sapiens (Human)
Description:
O15379
Residue:
428
  
Component 2
Name:
Nuclear receptor corepressor 2
Synonyms:
CTG repeat protein 26 Histone deacetylase 2/Nuclear receptor corepressor 2 NCOR2 Nuclear receptor corepressor 2 SMAP270 Silencing mediator of retinoic acid and thyroid hormone receptor TRAC | Thyroid-, retinoic-acid-receptor-associated corepressor
Type:
Enzyme
Mol. Mass.:
274839.59
Organism:
Homo sapiens (Human)
Description:
Q9Y618
Residue:
2514
  
Inhibitor
Name:
BDBM29589
Synonyms:
Faridak LBH-589B US10722597, Compound Panobinostat
Type:
Small organic molecule
Emp. Form.:
C21H23N3O2
Mol. Mass.:
349.4262
SMILES:
Cc1[nH]c2ccccc2c1CCNCc1ccc(\C=C\C(=O)NO)cc1
: