Target
Cyclin-dependent kinase 8
Ligand
BDBM50189442
Substrate
Meas. Tech.
ChEMBL_1589660 (CHEMBL3829689)
IC50
4.7±n/a nM
Citation
 Mallinger, ASchiemann, KRink, CSejberg, JHoney, MACzodrowski, PStubbs, MPoeschke, OBusch, MSchneider, RSchwarz, DMusil, DBurke, RUrbahns, KWorkman, PWienke, DClarke, PARaynaud, FIEccles, SAEsdar, CRohdich, FBlagg, J 2,8-Disubstituted-1,6-Naphthyridines and 4,6-Disubstituted-Isoquinolines with Potent, Selective Affinity for CDK8/19. ACS Med Chem Lett 7:573-8 (2016)  
Target
Name:
Cyclin-dependent kinase 8
Synonyms:
CDK8 Cell division protein kinase 8 Mediator complex subunit CDK8 Protein kinase K35
Type:
Serine/threonine-protein kinase
Mol. Mass.:
53300.21
Organism:
Homo sapiens (Human)
Description:
P49336
Residue:
464
  
Inhibitor
Name:
BDBM50189442
Synonyms:
CHEMBL3828503
Type:
Small organic molecule
Emp. Form.:
C22H18N4O2
Mol. Mass.:
370.4039
SMILES:
Cn1cc(cn1)-c1ccc(cc1)-c1cncc2ccc(cc12)N1CCOC1=O
: