Target
G-protein coupled receptor 84
Ligand
BDBM50189502
Substrate
Meas. Tech.
ChEBML_1589775
EC50
653±n/a nM
Citation
 Liu, YZhang, QChen, LHYang, HLu, WXie, XNan, FJ Design and Synthesis of 2-Alkylpyrimidine-4,6-diol and 6-Alkylpyridine-2,4-diol as Potent GPR84 Agonists. ACS Med Chem Lett 7:579-83 (2016)  
Target
Name:
G-protein coupled receptor 84
Synonyms:
EX33 GPR84 Inflammation-related G-protein coupled receptor EX33
Type:
PROTEIN
Mol. Mass.:
43726.73
Organism:
Homo sapiens (Human)
Description:
ChEMBL_116040
Residue:
396
  
Inhibitor
Name:
BDBM50189502
Synonyms:
CHEMBL3827832
Type:
Small organic molecule
Emp. Form.:
C12H21N3O2
Mol. Mass.:
239.314
SMILES:
CCCCCCCCNc1cc(=O)[nH]c(=O)[nH]1
: