Target
Endoplasmic reticulum aminopeptidase 1
Ligand
BDBM50316049
Substrate
Meas. Tech.
ChEBML_1591201
Ki
26900±n/a nM
Citation
 Weglarz-Tomczak, EVassiliou, SMucha, A Discovery of potent and selective inhibitors of human aminopeptidases ERAP1 and ERAP2 by screening libraries of phosphorus-containing amino acid and dipeptide analogues. Bioorg Med Chem Lett 26:4122-6 (2016)  
Target
Name:
Endoplasmic reticulum aminopeptidase 1
Synonyms:
APPILS Aminopeptidase ERAP1_HUMAN | KIAA0525
Type:
PROTEIN
Mol. Mass.:
107232.03
Organism:
Homo sapiens (Human)
Description:
ChEMBL_1473167
Residue:
941
  
Inhibitor
Name:
BDBM50316049
Synonyms:
1-amino-3-phenylpropylphosphonic acid | CHEMBL1090914
Type:
Small organic molecule
Emp. Form.:
C9H14NO3P
Mol. Mass.:
215.1861
SMILES:
NC(CCc1ccccc1)P(O)(O)=O
: