Target
Hepatocyte growth factor receptor
Ligand
BDBM50190130
Substrate
Meas. Tech.
ChEBML_1591355
IC50
11780±n/a nM
Citation
 Wang, LWu, RFu, WLao, YZheng, CTan, HXu, H Synthesis and biological evaluation of Oblongifolin C derivatives as c-Met inhibitors. Bioorg Med Chem 24:4120-4128 (2016)  
Target
Name:
Hepatocyte growth factor receptor
Synonyms:
Hepatocyte growth factor receptor Hepatocyte growth factor receptor (c-MET) MET Met proto-oncogene (hepatocyte growth factor receptor) Tyrosine-protein kinase Met (c-Met) c-Met kinase
Type:
Protein
Mol. Mass.:
155559.73
Organism:
Homo sapiens (Human)
Description:
P08581
Residue:
1390
  
Inhibitor
Name:
BDBM50190130
Synonyms:
CHEMBL3827525
Type:
Small organic molecule
Emp. Form.:
C45H60O7
Mol. Mass.:
712.9537
SMILES:
[#6]\[#6](-[#6])=[#6]\[#6]-[#6]\[#6](-[#6])=[#6]\[#6]-[#6@@H]1-[#6][C@@]2([#6]\[#6]=[#6](\[#6])-[#6])[#6](-[#8])=[#6](-[#6](=O)-c3ccc(-[#8])c(-[#8]-[#6](-[#6])=O)c3)-[#6](=O)[C@]([#6]\[#6]=[#6](\[#6])-[#6])([#6]2=O)[C@@]1([#6])[#6]-[#6]\[#6]=[#6](\[#6])-[#6]
: