Target
Alpha-glucosidase MAL12
Ligand
BDBM50180587
Substrate
Meas. Tech.
ChEMBL_1589205 (CHEMBL3829978)
IC50
33900±n/a nM
Citation
 Suresh, LOnkara, PKumar, PSPydisetty, YChandramouli, GV Ionic liquid-promoted multicomponent synthesis of fused tetrazolo[1,5-a]pyrimidines asa-glucosidase inhibitors. Bioorg Med Chem Lett 26:4007-14 (2016)  
Target
Name:
Alpha-glucosidase MAL12
Synonyms:
α-Glucosidase MAL12_YEAST Maltase | alpha-Glucosidase (α-Glucosidase)
Type:
Protein
Mol. Mass.:
68084.32
Organism:
Saccharomyces cerevisiae
Description:
P53341
Residue:
584
  
Inhibitor
Name:
BDBM50180587
Synonyms:
CHEMBL3734896
Type:
Small organic molecule
Emp. Form.:
C25H43NO18
Mol. Mass.:
645.6048
SMILES:
[H]C1(OC2C(CO)OC([H])(OC3C(CO)OC(O)C(O)C3O)C(O)C2O)OC(C)C(NC2([H])C=C(CO)C(O)C(O)C2O)C(O)C1O
: