Target
Dihydrofolate reductase
Ligand
BDBM18069
Substrate
Meas. Tech.
ChEMBL_1589520 (CHEMBL3829094)
Ki
0.220000±n/a nM
Citation
 Scocchera, EReeve, SMKeshipeddy, SLombardo, MNHajian, BSochia, AEAlverson, JBPriestley, NDAnderson, ACWright, DL Charged Nonclassical Antifolates with Activity Against Gram-Positive and Gram-Negative Pathogens. ACS Med Chem Lett 7:692-6 (2016)  
Target
Name:
Dihydrofolate reductase
Synonyms:
Dihydrofolate reductase (F31V) | dfrA17
Type:
Mol. Mass.:
17532.46
Organism:
Escherichia coli
Description:
Residue:
157
  
Inhibitor
Name:
BDBM18069
Synonyms:
5-[(3,4,5-trimethoxyphenyl)methyl]pyrimidine-2,4-diamine TMP Trimethoprim (TMP) | US10870625, Compound TMP
Type:
Small organic molecule
Emp. Form.:
C14H18N4O3
Mol. Mass.:
290.3177
SMILES:
COc1cc(Cc2cnc(N)nc2N)cc(OC)c1OC
: