Target
Prothrombin
Ligand
BDBM50112086
Substrate
Meas. Tech.
ChEMBL_1612584 (CHEMBL3854384)
IC50
1.2±n/a nM
Citation
 Ren, WRen, YWang, S Design, synthesis, anticoagulant activity evaluation and molecular docking studies of a class of N-ethyl dabigatran derivatives. Eur J Med Chem 120:148-59 (2016)  
Target
Name:
Prothrombin
Synonyms:
Activation peptide fragment 1 Coagulation factor II Prothrombin precursor Thrombin heavy chain | Thrombin light chain
Type:
Protein
Mol. Mass.:
70029.57
Organism:
Homo sapiens (Human)
Description:
P00734
Residue:
622
  
Inhibitor
Name:
BDBM50112086
Synonyms:
3-({2-[(4-Carbamimidoyl-phenylamino)-methyl]-1-methyl-1H-benzoimidazole-5-carbonyl}-pyridin-2-yl-amino)-propionic acid DABIGATRAN
Type:
Small organic molecule
Emp. Form.:
C25H25N7O3
Mol. Mass.:
471.5111
SMILES:
Cn1c(CNc2ccc(cc2)C(N)=N)nc2cc(ccc12)C(=O)N(CCC(O)=O)c1ccccn1
: