Target
Beta-adrenergic receptor kinase 2
Ligand
BDBM50191313
Substrate
Meas. Tech.
ChEBML_1612836
IC50
6100±n/a nM
Citation
 Guccione, MEttari, RTaliani, SDa Settimo, FZappalą, MGrasso, S G-Protein-Coupled Receptor Kinase 2 (GRK2) Inhibitors: Current Trends and Future Perspectives. J Med Chem 59:9277-9294 (2016)  
Target
Name:
Beta-adrenergic receptor kinase 2
Synonyms:
ADRBK2 Beta-ARK-2 G-protein-coupled receptor kinase 3 | GRK3
Type:
PROTEIN
Mol. Mass.:
79815.63
Organism:
Bos taurus
Description:
ChEMBL_113448
Residue:
688
  
Inhibitor
Name:
BDBM50191313
Synonyms:
CHEMBL3931500
Type:
Small organic molecule
Emp. Form.:
C112H178N28O34
Mol. Mass.:
2460.7789
SMILES:
CC[C@H](C)[C@H](NC(=O)[C@H](C)NC(=O)[C@@H](NC(=O)[C@@H](N)CCCCN)[C@@H](C)O)C(=O)N[C@@H](C)C(=O)N[C@@H](CCCCN)C(=O)N[C@@H](Cc1ccccc1)C(=O)N[C@@H](CCC(O)=O)C(=O)N[C@@H](CCCNC(N)=N)C(=O)N[C@@H](CC(C)C)C(=O)N[C@@H](CCC(N)=O)C(=O)N[C@@H]([C@@H](C)O)C(=O)N[C@@H](C(C)C)C(=O)N[C@@H]([C@@H](C)O)C(=O)N[C@@H](CC(N)=O)C(=O)N[C@@H](Cc1ccc(O)cc1)C(=O)N[C@@H](Cc1ccccc1)C(=O)N[C@@H]([C@@H](C)CC)C(=O)N[C@@H]([C@@H](C)O)C(=O)N[C@@H](CO)C(=O)N[C@@H](CCC(O)=O)C(O)=O
: