Target
Rhodopsin kinase GRK1
Ligand
BDBM14056
Substrate
Meas. Tech.
ChEMBL_1612830 (CHEMBL3854630)
IC50
1000000±n/a nM
Citation
 Guccione, MEttari, RTaliani, SDa Settimo, FZappalą, MGrasso, S G-Protein-Coupled Receptor Kinase 2 (GRK2) Inhibitors: Current Trends and Future Perspectives. J Med Chem 59:9277-9294 (2016)  
Target
Name:
Rhodopsin kinase GRK1
Synonyms:
G protein-coupled receptor kinase 1 GRK1_BOVIN Rhodopsin kinase
Type:
PROTEIN
Mol. Mass.:
62931.24
Organism:
Bos taurus
Description:
ChEMBL_116985
Residue:
561
  
Inhibitor
Name:
BDBM14056
Synonyms:
N-(7-chloro-1H-indazol-5-yl)-2-methyl-6-oxo-4-[4-(trifluoromethyl)phenyl]-1,4,5,6-tetrahydropyridine-3-carboxamide | dihydropyridone indazole amide 16
Type:
Small organic molecule
Emp. Form.:
C21H16ClF3N4O2
Mol. Mass.:
448.826
SMILES:
CC1=C(C(CC(=O)N1)c1ccc(cc1)C(F)(F)F)C(=O)Nc1cc(Cl)c2[nH]ncc2c1
: