Target
Rhodopsin kinase GRK1
Ligand
BDBM50173320
Substrate
Meas. Tech.
ChEMBL_1612830 (CHEMBL3854630)
IC50
>1000000±n/a nM
Citation
 Guccione, MEttari, RTaliani, SDa Settimo, FZappalą, MGrasso, S G-Protein-Coupled Receptor Kinase 2 (GRK2) Inhibitors: Current Trends and Future Perspectives. J Med Chem 59:9277-9294 (2016)  
Target
Name:
Rhodopsin kinase GRK1
Synonyms:
G protein-coupled receptor kinase 1 GRK1_BOVIN Rhodopsin kinase
Type:
PROTEIN
Mol. Mass.:
62931.24
Organism:
Bos taurus
Description:
ChEMBL_116985
Residue:
561
  
Inhibitor
Name:
BDBM50173320
Synonyms:
GSK-180736A US10023564, Compound GSK180736A
Type:
Small organic molecule
Emp. Form.:
C19H16FN5O2
Mol. Mass.:
365.361
SMILES:
CC1=C(C(NC(=O)N1)c1ccc(F)cc1)C(=O)Nc1ccc2[nH]ncc2c1
: