Target
DNA polymerase kappa
Ligand
BDBM50250399
Substrate
Meas. Tech.
ChEMBL_1612841 (CHEMBL3854641)
IC50
5600±n/a nM
Citation
 Korzhnev, DMHadden, MK Targeting the Translesion Synthesis Pathway for the Development of Anti-Cancer Chemotherapeutics. J Med Chem 59:9321-9336 (2016)  
Target
Name:
DNA polymerase kappa
Synonyms:
DINB1 POLK_HUMAN
Type:
PROTEIN
Mol. Mass.:
98825.18
Organism:
Homo sapiens (Human)
Description:
ChEMBL_1297316
Residue:
870
  
Inhibitor
Name:
BDBM50250399
Synonyms:
5-Hydroxy-4-{(R)-6-hydroxy-5-[(E)-4-methyl-6-(2,6,6-trimethyl-cyclohex-1-enyl)-hex-3-enyl]-3,6-dihydro-2H-pyran-2-yl}-5H-furan-2-one CHEMBL463914 | manoalide
Type:
Small organic molecule
Emp. Form.:
C25H36O5
Mol. Mass.:
416.5503
SMILES:
C\C(CCC1=C(C)CCCC1(C)C)=C/CCC1=CC[C@@H](O[C@H]1O)C1=CC(=O)O[C@H]1O
: