Target
Platelet-derived growth factor receptor alpha
Ligand
BDBM50191972
Substrate
Meas. Tech.
ChEMBL_1613237 (CHEMBL3855037)
IC50
1.3±n/a nM
Citation
 Shaw, DEBaig, FBruce, IChamoin, SCollingwood, SPCross, SDayal, SDrückes, PFuret, PFurminger, VHaggart, DHussey, MKonstantinova, ILoren, JCMolteni, VRoberts, SReilly, JSaunders, AMStringer, RSviridenko, LThomas, MThomson, CGTomlins, CWen, BYeh, VPearce, AC Optimization of Platelet-Derived Growth Factor Receptor (PDGFR) Inhibitors for Duration of Action, as an Inhaled Therapy for Lung Remodeling in Pulmonary Arterial Hypertension. J Med Chem 59:7901-14 (2016)  
Target
Name:
Platelet-derived growth factor receptor alpha
Synonyms:
Alpha-type platelet-derived growth factor receptor PDGFRA PGFRA_HUMAN Platelet-derived growth factor receptor alpha (PDGFRA) RHEPDGFRA
Type:
Protein
Mol. Mass.:
122633.38
Organism:
Homo sapiens (Human)
Description:
P16234
Residue:
1089
  
Inhibitor
Name:
BDBM50191972
Synonyms:
CHEMBL3895824
Type:
Small organic molecule
Emp. Form.:
C28H32FN7O2
Mol. Mass.:
517.5978
SMILES:
C[C@H]1CCC[C@@H](C)N1CCNC(=O)c1ccc(F)c(NC(=O)c2cnc3cc(ccn23)-c2ccnn2C)c1
: