Target
Platelet-derived growth factor receptor alpha
Ligand
BDBM50192005
Substrate
Meas. Tech.
ChEMBL_1613237 (CHEMBL3855037)
IC50
1.2±n/a nM
Citation
 Shaw, DEBaig, FBruce, IChamoin, SCollingwood, SPCross, SDayal, SDrückes, PFuret, PFurminger, VHaggart, DHussey, MKonstantinova, ILoren, JCMolteni, VRoberts, SReilly, JSaunders, AMStringer, RSviridenko, LThomas, MThomson, CGTomlins, CWen, BYeh, VPearce, AC Optimization of Platelet-Derived Growth Factor Receptor (PDGFR) Inhibitors for Duration of Action, as an Inhaled Therapy for Lung Remodeling in Pulmonary Arterial Hypertension. J Med Chem 59:7901-14 (2016)  
Target
Name:
Platelet-derived growth factor receptor alpha
Synonyms:
Alpha-type platelet-derived growth factor receptor PDGFRA PGFRA_HUMAN Platelet-derived growth factor receptor alpha (PDGFRA) RHEPDGFRA
Type:
Protein
Mol. Mass.:
122633.38
Organism:
Homo sapiens (Human)
Description:
P16234
Residue:
1089
  
Inhibitor
Name:
BDBM50192005
Synonyms:
CHEMBL3947262
Type:
Small organic molecule
Emp. Form.:
C31H31FN8O2
Mol. Mass.:
566.6286
SMILES:
CN1CCN(CC1)c1ccccc1CNC(=O)c1ccc(F)c(NC(=O)c2cnn3cc(ccc23)-c2ccnn2C)c1
: