Target
Leukocyte surface antigen CD47
Ligand
BDBM50192011
Substrate
Meas. Tech.
ChEMBL_1613291 (CHEMBL3855091)
Kd
18000±n/a nM
Citation
 Denèfle, TBoullet, HHerbi, LNewton, CMartinez-Torres, ACGuez, APramil, EQuiney, CPourcelot, MLevasseur, MDLardé, EMoumné, ROgi, FXGrondin, PMerle-Beral, HLequin, OSusin, SAKaroyan, P Thrombospondin-1 Mimetic Agonist Peptides Induce Selective Death in Tumor Cells: Design, Synthesis, and Structure-Activity Relationship Studies. J Med Chem 59:8412-21 (2016)  
Target
Name:
Leukocyte surface antigen CD47
Synonyms:
Antigenic surface determinant protein OA3 CD47_HUMAN IAP Leukocyte surface antigen CD47 Protein MER6
Type:
PROTEIN
Mol. Mass.:
35214.74
Organism:
Homo sapiens (Human)
Description:
ChEMBL_116544
Residue:
323
  
Inhibitor
Name:
BDBM50192011
Synonyms:
CHEMBL3911226
Type:
Small organic molecule
Emp. Form.:
C69H107N17O12
Mol. Mass.:
1366.6946
SMILES:
CCCCC(NC(=O)[C@@H](NC(=O)[C@@H](NC(=O)[C@H](Cc1ccc(O)cc1)NC(=O)[C@H](Cc1ccccc1)NC(=O)[C@H](CCCNC(N)=N)NC(=O)[C@H](N)CCCCN)C(C)C)C(C)C)C(=O)N[C@@H](Cc1c[nH]c2ccccc12)C(=O)N[C@@H](CCCCN)C(=O)N[C@H](CCCCN)C(O)=O
: