Target
Peroxisome proliferator-activated receptor delta
Ligand
BDBM50192833
Substrate
Meas. Tech.
ChEMBL_1613916 (CHEMBL3855716)
EC50
65±n/a nM
Citation
 Blass, B PPAR Agonists, Compounds, Pharmaceutical Compositions, and Methods of Use Thereof. ACS Med Chem Lett 7:824-5 (2016)  
Target
Name:
Peroxisome proliferator-activated receptor delta
Synonyms:
NR1C2 NUCI Nuclear receptor subfamily 1 group C member 2 PPAR-beta PPARD Peroxisome proliferator-activated receptor Peroxisome proliferator-activated receptor delta
Type:
Enzyme
Mol. Mass.:
49910.45
Organism:
Homo sapiens (Human)
Description:
Q03181
Residue:
441
  
Inhibitor
Name:
BDBM50192833
Synonyms:
CHEMBL3923083 | US10188627, Compound 8j
Type:
Small organic molecule
Emp. Form.:
C26H29NO5
Mol. Mass.:
435.5122
SMILES:
CC(CCCOc1ccccc1CN(C)C(=O)c1ccc(cc1)-c1ccco1)CC(O)=O
: