Target
Cyclin-A2/Cyclin-dependent kinase 2
Ligand
BDBM50113281
Substrate
Meas. Tech.
ChEMBL_1614402 (CHEMBL3856471)
Ki
44±n/a nM
Citation
 Sonawane, YATaylor, MANapoleon, JVRana, SContreras, JINatarajan, A Cyclin Dependent Kinase 9 Inhibitors for Cancer Therapy. J Med Chem 59:8667-8684 (2016)  
Target
Name:
Cyclin-A2/Cyclin-dependent kinase 2
Synonyms:
CDK2-CyclinA CDK2/Cyclin A Cyclin A2/dependent kinase 2 Cyclin-Dependent Kinase 2 (CDK2A)
Type:
Protein Complex
Mol. Mass.:
Description:
Cdk2/Cyclin A kinase was purified from insect cells coinfected with Cyclin A/Cdk2 baculovirus.
Components:
This complex has 2 components.
Component 1
Name:
Cyclin-dependent kinase 2
Synonyms:
CDK2 CDK2_HUMAN Cell division protein kinase 2 Protein cereblon/Cyclin-dependent kinase 2 | p33 protein kinase
Type:
Enzyme Subunit
Mol. Mass.:
33938.17
Organism:
Homo sapiens (Human)
Description:
P24941
Residue:
298
  
Component 2
Name:
Cyclin-A2
Synonyms:
CCN1 CCNA1 CCNA2_HUMAN Cyclin-A
Type:
Enzyme Subunit
Mol. Mass.:
48550.19
Organism:
Homo sapiens (Human)
Description:
P20248
Residue:
432
  
Inhibitor
Name:
BDBM50113281
Synonyms:
AT-7519
Type:
Small organic molecule
Emp. Form.:
C16H17Cl2N5O2
Mol. Mass.:
382.244
SMILES:
Clc1cccc(Cl)c1C(=O)Nc1c[nH]nc1C(=O)NC1CCNCC1
: