Target
Cyclin-dependent kinase 2/G1/S-specific cyclin-E1
Ligand
BDBM8037
Substrate
Meas. Tech.
ChEMBL_1614431 (CHEMBL3856500)
Ki
6500±n/a nM
Citation
 Sonawane, YATaylor, MANapoleon, JVRana, SContreras, JINatarajan, A Cyclin Dependent Kinase 9 Inhibitors for Cancer Therapy. J Med Chem 59:8667-8684 (2016)  
Target
Name:
Cyclin-dependent kinase 2/G1/S-specific cyclin-E1
Synonyms:
CDK2/CycE CDK2/E Cyclin-Dependent Kinase 2 (CDK2) Cyclin-dependent kinase 2/cyclin E1
Type:
Protein
Mol. Mass.:
Description:
Components:
This complex has 2 components.
Component 1
Name:
Cyclin-dependent kinase 2
Synonyms:
CDK2 CDK2_HUMAN Cell division protein kinase 2 Protein cereblon/Cyclin-dependent kinase 2 | p33 protein kinase
Type:
Enzyme Subunit
Mol. Mass.:
33938.17
Organism:
Homo sapiens (Human)
Description:
P24941
Residue:
298
  
Component 2
Name:
G1/S-specific cyclin-E1
Synonyms:
CCNE CCNE1_HUMAN
Type:
Enzyme Subunit
Mol. Mass.:
47073.17
Organism:
Homo sapiens (Human)
Description:
Residue:
410
  
Inhibitor
Name:
BDBM8037
Synonyms:
2-Anilino-4-(thiazol-5-yl)pyrimidine deriv. 8 4-(2,4-dimethyl-1,3-thiazol-5-yl)pyrimidin-2-amine CS12
Type:
Small organic molecule
Emp. Form.:
C9H10N4S
Mol. Mass.:
206.268
SMILES:
Cc1nc(C)c(s1)-c1ccnc(N)n1
: