Target
Cyclin-dependent kinase 4/G1/S-specific cyclin-D1
Ligand
BDBM5655
Substrate
Meas. Tech.
ChEMBL_1614412 (CHEMBL3856481)
IC50
132±n/a nM
Citation
 Sonawane, YATaylor, MANapoleon, JVRana, SContreras, JINatarajan, A Cyclin Dependent Kinase 9 Inhibitors for Cancer Therapy. J Med Chem 59:8667-8684 (2016)  
Target
Name:
Cyclin-dependent kinase 4/G1/S-specific cyclin-D1
Synonyms:
CDK4/CycD CDK4/Cyclin D1 Cyclin-Dependent Kinase 4 (CDK4) Cyclin-dependent kinase 4/G1/S-specific cyclin D1 | Cyclin-dependent kinase 4/cyclin D1
Type:
Protein Complex
Mol. Mass.:
Description:
CDK4/D1 complexes were purified from insect cells co-infected with baculovirus vectors containing each of the components.
Components:
This complex has 2 components.
Component 1
Name:
Cyclin-dependent kinase 4
Synonyms:
CDK4 Cell division protein kinase 4 PSK-J3
Type:
Enzyme Subunit
Mol. Mass.:
33731.96
Organism:
Homo sapiens (Human)
Description:
P11802
Residue:
303
  
Component 2
Name:
G1/S-specific cyclin-D1
Synonyms:
B-cell lymphoma 1 protein BCL-1 oncogene CCND1 PRAD1 | PRAD1 oncogene
Type:
Enzyme Subunit
Mol. Mass.:
33717.70
Organism:
Homo sapiens (Human)
Description:
Residue:
295
  
Inhibitor
Name:
BDBM5655
Synonyms:
2-(2-chlorophenyl)-5,7-dihydroxy-8-[(3S,4R)-3-hydroxy-1-methylpiperidin-4-yl]-4H-chromen-4-one Flavopiridol US9617225, Flavopiridol
Type:
Small organic molecule
Emp. Form.:
C21H20ClNO5
Mol. Mass.:
401.84
SMILES:
CN1CC[C@@H]([C@H](O)C1)c1c(O)cc(O)c2c1oc(cc2=O)-c1ccccc1Cl
: