Target
Receptor-type tyrosine-protein kinase FLT3
Ligand
BDBM50021574
Substrate
Meas. Tech.
ChEMBL_1615845 (CHEMBL3857914)
IC50
6.0±n/a nM
Citation
 Talele, TT The"Cyclopropyl Fragment" is a Versatile Player that Frequently Appears in Preclinical/Clinical Drug Molecules. J Med Chem 59:8712-8756 (2016)  
Target
Name:
Receptor-type tyrosine-protein kinase FLT3
Synonyms:
CD135 FL cytokine receptor FLK2 FLT3 Fetal liver kinase-2 Fms-like tyrosine kinase 3 (Flt-3) STK-1 Stem cell tyrosine kinase 1
Type:
Enzyme
Mol. Mass.:
112888.62
Organism:
Homo sapiens (Human)
Description:
P36888
Residue:
993
  
Inhibitor
Name:
BDBM50021574
Synonyms:
BMS-907351 CHEBI:72317 Cometriq US10202365, Compound Cabozantinib US10273211, Compound Cabozantinib US10774070, Compound Cabozantinib XL-184 | cabozantinib s-malate
Type:
Small organic molecule
Emp. Form.:
C28H24FN3O5
Mol. Mass.:
501.5057
SMILES:
COc1cc2nccc(Oc3ccc(NC(=O)C4(CC4)C(=O)Nc4ccc(F)cc4)cc3)c2cc1OC
: