Target
Transient receptor potential cation channel subfamily A member 1
Ligand
BDBM50193600
Substrate
Meas. Tech.
ChEMBL_1615960 (CHEMBL3858029)
IC50
7.0±n/a nM
Citation
 Blass, B N-(2-Alkyleneimino-3-phenylpropyl)acetamide Compounds and Their Use against Pain and Pruritus via Inhibition of TRPA1 Channels. ACS Med Chem Lett 7:658-9 (2016)  
Target
Name:
Transient receptor potential cation channel subfamily A member 1
Synonyms:
ANKTM1 TRPA1 Transformation-sensitive protein p120 | Transient receptor potential cation channel subfamily A member 1 (TRPA1)
Type:
Protein
Mol. Mass.:
127514.20
Organism:
Homo sapiens (Human)
Description:
O75762
Residue:
1119
  
Inhibitor
Name:
BDBM50193600
Synonyms:
CHEMBL3974466
Type:
Small organic molecule
Emp. Form.:
C27H32ClF3N2O
Mol. Mass.:
493.004
SMILES:
FC(F)(F)C1CCN(CC1)C(CNC(=O)C1(CCCC1)c1ccc(Cl)cc1)Cc1ccccc1
: