Target
Chromobox protein homolog 5
Ligand
BDBM50194427
Substrate
Meas. Tech.
ChEMBL_1616626 (CHEMBL3858695)
IC50
>60000±n/a nM
Citation
 Stuckey, JISimpson, CNorris-Drouin, JLCholensky, SHLee, JPasca, RCheng, NDickson, BMPearce, KHFrye, SVJames, LI Structure-Activity Relationships and Kinetic Studies of Peptidic Antagonists of CBX Chromodomains. J Med Chem 59:8913-8923 (2016)  
Target
Name:
Chromobox protein homolog 5
Synonyms:
Antigen p25 CBX5_HUMAN HP1 alpha Heterochromatin protein 1 homolog alpha
Type:
PROTEIN
Mol. Mass.:
22222.71
Organism:
Homo sapiens (Human)
Description:
ChEMBL_116826
Residue:
191
  
Inhibitor
Name:
BDBM50194427
Synonyms:
CHEMBL3932467
Type:
Small organic molecule
Emp. Form.:
C44H63N7O9
Mol. Mass.:
834.0125
SMILES:
COC(=O)[C@H](CO)NC(=O)[C@H](CCCCNC1CC2CCC1C2)NC(=O)[C@H](CC(C)C)NC(=O)[C@H](C)NC(=O)[C@H](Cc1ccccc1)NC(=O)CNC(=O)c1ccccc1
: