Target
Chromobox protein homolog 5
Ligand
BDBM50194477
Substrate
Meas. Tech.
ChEMBL_1616626 (CHEMBL3858695)
IC50
44000±n/a nM
Citation
 Stuckey, JISimpson, CNorris-Drouin, JLCholensky, SHLee, JPasca, RCheng, NDickson, BMPearce, KHFrye, SVJames, LI Structure-Activity Relationships and Kinetic Studies of Peptidic Antagonists of CBX Chromodomains. J Med Chem 59:8913-8923 (2016)  
Target
Name:
Chromobox protein homolog 5
Synonyms:
Antigen p25 CBX5_HUMAN HP1 alpha Heterochromatin protein 1 homolog alpha
Type:
PROTEIN
Mol. Mass.:
22222.71
Organism:
Homo sapiens (Human)
Description:
ChEMBL_116826
Residue:
191
  
Inhibitor
Name:
BDBM50194477
Synonyms:
CHEMBL3916023
Type:
Small organic molecule
Emp. Form.:
C49H77N7O10
Mol. Mass.:
924.1766
SMILES:
CCN(CC)CCCC[C@H](NC(=O)[C@H](CC(C)C)NC(=O)[C@H](C)NC(=O)[C@H](Cc1ccc(CNC(=O)OC(C)(C)C)cc1)NC(=O)c1ccc(cc1)C(C)(C)C)C(=O)N[C@@H](CO)C(=O)OC
: