Target
Chromodomain Y-like protein 2
Ligand
BDBM50194471
Substrate
Meas. Tech.
ChEMBL_1616627 (CHEMBL3858696)
IC50
110±n/a nM
Citation
 Stuckey, JISimpson, CNorris-Drouin, JLCholensky, SHLee, JPasca, RCheng, NDickson, BMPearce, KHFrye, SVJames, LI Structure-Activity Relationships and Kinetic Studies of Peptidic Antagonists of CBX Chromodomains. J Med Chem 59:8913-8923 (2016)  
Target
Name:
Chromodomain Y-like protein 2
Synonyms:
CDY-like 2 CDYL2_HUMAN | Chromodomain Y-like protein 2
Type:
PROTEIN
Mol. Mass.:
56517.92
Organism:
Homo sapiens (Human)
Description:
ChEMBL_116982
Residue:
506
  
Inhibitor
Name:
BDBM50194471
Synonyms:
CHEMBL3943850
Type:
Small organic molecule
Emp. Form.:
C41H60N6O10
Mol. Mass.:
796.9493
SMILES:
CCN(CC)CCCC[C@H](NC(=O)[C@H](CC(C)C)NC(=O)[C@H](C)NC(=O)[C@H](Cc1ccccc1)NC(=O)c1ccc(cc1)C(=O)OC)C(=O)N[C@@H](CO)C(=O)OC
: