Target
Dipeptidyl peptidase 1
Ligand
BDBM50195251
Substrate
Meas. Tech.
ChEMBL_1617559 (CHEMBL3859628)
IC50
40±n/a nM
Citation
 Connolly, SLönn, HKäck, HVan de Poël, ADahl, GDoyle, KGardiner, PRoot, JWikell, CJohannesson, PStenvall, KSwallow, S Discovery of Second Generation Reversible Covalent DPP1 Inhibitors Leading to an Oxazepane Amidoacetonitrile Based Clinical Candidate (AZD7986). J Med Chem 59:9457-9472 (2016)  
Target
Name:
Dipeptidyl peptidase 1
Synonyms:
CATC_HUMAN CTSC Cathepsin J Dipeptidyl peptidase 1 (DPPI) Dipeptidyl peptidase I (DPPI)
Type:
Enzyme
Mol. Mass.:
51857.28
Organism:
Homo sapiens (Human)
Description:
P53634
Residue:
463
  
Inhibitor
Name:
BDBM50195251
Synonyms:
CHEMBL3927522
Type:
Small organic molecule
Emp. Form.:
C23H24N4O
Mol. Mass.:
372.4629
SMILES:
N[C@H]1CCCC[C@H]1C(=O)N[C@@H](Cc1ccc(cc1)-c1ccc(cc1)C#N)C#N
: