Target
Dipeptidyl peptidase 1
Ligand
BDBM50195235
Substrate
Meas. Tech.
ChEMBL_1617580 (CHEMBL3859649)
IC50
25±n/a nM
Citation
 Connolly, SLönn, HKäck, HVan de Poël, ADahl, GDoyle, KGardiner, PRoot, JWikell, CJohannesson, PStenvall, KSwallow, S Discovery of Second Generation Reversible Covalent DPP1 Inhibitors Leading to an Oxazepane Amidoacetonitrile Based Clinical Candidate (AZD7986). J Med Chem 59:9457-9472 (2016)  
Target
Name:
Dipeptidyl peptidase 1
Synonyms:
CATC_MOUSE Dipeptidyl peptidase I
Type:
PROTEIN
Mol. Mass.:
52379.83
Organism:
Mus musculus
Description:
ChEMBL_44964
Residue:
462
  
Inhibitor
Name:
BDBM50195235
Synonyms:
CHEMBL3900409 US10669245, Example 2 US11655221, Example 2 US20230278969, Example 2
Type:
Small organic molecule
Emp. Form.:
C23H24N4O4
Mol. Mass.:
420.4611
SMILES:
Cn1c2cc(ccc2oc1=O)-c1ccc(C[C@H](NC(=O)[C@@H]2CNCCCO2)C#N)cc1
: