Target
Cathepsin G
Ligand
BDBM50195235
Substrate
Meas. Tech.
ChEMBL_1617592 (CHEMBL3859661)
IC50
>20000±n/a nM
Citation
 Connolly, SLönn, HKäck, HVan de Poël, ADahl, GDoyle, KGardiner, PRoot, JWikell, CJohannesson, PStenvall, KSwallow, S Discovery of Second Generation Reversible Covalent DPP1 Inhibitors Leading to an Oxazepane Amidoacetonitrile Based Clinical Candidate (AZD7986). J Med Chem 59:9457-9472 (2016)  
Target
Name:
Cathepsin G
Synonyms:
CATG_HUMAN CTSG
Type:
PROTEIN
Mol. Mass.:
28860.08
Organism:
Homo sapiens (Human)
Description:
ChEMBL_1469016
Residue:
255
  
Inhibitor
Name:
BDBM50195235
Synonyms:
CHEMBL3900409 US10669245, Example 2 US11655221, Example 2 US20230278969, Example 2
Type:
Small organic molecule
Emp. Form.:
C23H24N4O4
Mol. Mass.:
420.4611
SMILES:
Cn1c2cc(ccc2oc1=O)-c1ccc(C[C@H](NC(=O)[C@@H]2CNCCCO2)C#N)cc1
: