Target
Alpha-1A adrenergic receptor
Ligand
BDBM50195275
Substrate
Meas. Tech.
ChEMBL_1617618 (CHEMBL3859687)
IC50
18±n/a nM
Citation
 Guo, DLi, JLin, HZhou, YChen, YZhao, FSun, HZhang, DLi, HShoichet, BKShan, LZhang, WXie, XJiang, HLiu, H Design, Synthesis, and Biological Evaluation of Novel Tetrahydroprotoberberine Derivatives (THPBs) as Selectivea J Med Chem 59:9489-9502 (2016)  
Target
Name:
Alpha-1A adrenergic receptor
Synonyms:
ADA1A_HUMAN ADRA1C Alpha 1A-adrenoceptor Alpha adrenergic receptor 1a Alpha-adrenergic receptor 1c adrenergic Alpha1 | adrenergic Alpha1C
Type:
Cell-surface receptors
Mol. Mass.:
51511.67
Organism:
Homo sapiens (Human)
Description:
P35348
Residue:
466
  
Inhibitor
Name:
BDBM50195275
Synonyms:
CHEMBL3916182
Type:
Small organic molecule
Emp. Form.:
C21H20N2O3
Mol. Mass.:
348.3951
SMILES:
COc1ccc2[nH]c3CN4CCc5cc6OCOc6cc5C4Cc3c2c1
: