Target
Alpha-1B adrenergic receptor
Ligand
BDBM50195274
Substrate
Meas. Tech.
ChEMBL_1617626 (CHEMBL3859695)
IC50
>1000±n/a nM
Citation
 Guo, DLi, JLin, HZhou, YChen, YZhao, FSun, HZhang, DLi, HShoichet, BKShan, LZhang, WXie, XJiang, HLiu, H Design, Synthesis, and Biological Evaluation of Novel Tetrahydroprotoberberine Derivatives (THPBs) as Selectivea J Med Chem 59:9489-9502 (2016)  
Target
Name:
Alpha-1B adrenergic receptor
Synonyms:
ADA1B_RAT Alpha 1B-adrenoceptor Alpha adrenergic receptor 1A and 1B Alpha-1Adrenoceptor Alpha-1B adrenoreceptor | adrenergic Alpha1B
Type:
G Protein-Coupled Receptor (GPCR)
Mol. Mass.:
56606.71
Organism:
Rattus norvegicus (rat)
Description:
Receptor binding assays were performed using rat cortical membranes.
Residue:
515
  
Inhibitor
Name:
BDBM50195274
Synonyms:
CHEMBL3892879
Type:
Small organic molecule
Emp. Form.:
C21H20N2O3
Mol. Mass.:
348.3951
SMILES:
[H][C@@]12Cc3c(CN1CCc1cc4OCOc4cc21)[nH]c1ccc(OC)cc31
: