Target
Alpha-1B adrenergic receptor
Ligand
BDBM50160154
Substrate
Meas. Tech.
ChEMBL_1617626 (CHEMBL3859695)
IC50
90±n/a nM
Citation
 Guo, DLi, JLin, HZhou, YChen, YZhao, FSun, HZhang, DLi, HShoichet, BKShan, LZhang, WXie, XJiang, HLiu, H Design, Synthesis, and Biological Evaluation of Novel Tetrahydroprotoberberine Derivatives (THPBs) as Selectivea J Med Chem 59:9489-9502 (2016)  
Target
Name:
Alpha-1B adrenergic receptor
Synonyms:
ADA1B_RAT Alpha 1B-adrenoceptor Alpha adrenergic receptor 1A and 1B Alpha-1Adrenoceptor Alpha-1B adrenoreceptor | adrenergic Alpha1B
Type:
G Protein-Coupled Receptor (GPCR)
Mol. Mass.:
56606.71
Organism:
Rattus norvegicus (rat)
Description:
Receptor binding assays were performed using rat cortical membranes.
Residue:
515
  
Inhibitor
Name:
BDBM50160154
Synonyms:
1-(3-Hydroxy-propyl)-5-((R)-2-{2-[2-(2,2,2-trifluoro-ethoxy)-phenoxy]-ethylamino}-propyl)-2,3-dihydro-1H-indole-7-carboxylic acid amide SILODOSIN
Type:
Small organic molecule
Emp. Form.:
C25H32F3N3O4
Mol. Mass.:
495.5345
SMILES:
C[C@H](Cc1cc2CCN(CCCO)c2c(c1)C(N)=O)NCCOc1ccccc1OCC(F)(F)F
: