Target
Alpha-1B adrenergic receptor
Ligand
BDBM50195271
Substrate
Meas. Tech.
ChEMBL_1617621 (CHEMBL3859690)
IC50
>10000±n/a nM
Citation
 Guo, DLi, JLin, HZhou, YChen, YZhao, FSun, HZhang, DLi, HShoichet, BKShan, LZhang, WXie, XJiang, HLiu, H Design, Synthesis, and Biological Evaluation of Novel Tetrahydroprotoberberine Derivatives (THPBs) as Selectivea J Med Chem 59:9489-9502 (2016)  
Target
Name:
Alpha-1B adrenergic receptor
Synonyms:
ADA1B_HUMAN Adrenergic alpha1B Adrenergic receptor alpha Alpha 1B-adrenoreceptor | Alpha-1B adrenergic receptor
Type:
Enzyme
Mol. Mass.:
56862.13
Organism:
Homo sapiens (Human)
Description:
P35368
Residue:
520
  
Inhibitor
Name:
BDBM50195271
Synonyms:
CHEMBL3937032
Type:
Small organic molecule
Emp. Form.:
C20H18N2O2
Mol. Mass.:
318.3691
SMILES:
[H][C@@]12Cc3c(CN1CCc1cc4OCOc4cc21)[nH]c1ccccc31
: