Target
Alpha-1D adrenergic receptor
Ligand
BDBM50195272
Substrate
Meas. Tech.
ChEMBL_1617622 (CHEMBL3859691)
IC50
8392±n/a nM
Citation
 Guo, DLi, JLin, HZhou, YChen, YZhao, FSun, HZhang, DLi, HShoichet, BKShan, LZhang, WXie, XJiang, HLiu, H Design, Synthesis, and Biological Evaluation of Novel Tetrahydroprotoberberine Derivatives (THPBs) as Selectivea J Med Chem 59:9489-9502 (2016)  
Target
Name:
Alpha-1D adrenergic receptor
Synonyms:
ADA1D_HUMAN ADRA1D Adrenergic receptor alpha Alpha 1D-adrenoreceptor Alpha-1D adrenoceptor adrenergic Alpha1D
Type:
Enzyme Catalytic Domain
Mol. Mass.:
60485.82
Organism:
Homo sapiens (Human)
Description:
adrenergic Alpha1D ADRA1D HUMAN::P25100
Residue:
572
  
Inhibitor
Name:
BDBM50195272
Synonyms:
CHEMBL3938121
Type:
Small organic molecule
Emp. Form.:
C20H17FN2O2
Mol. Mass.:
336.3596
SMILES:
Fc1ccc2[nH]c3CN4CCc5cc6OCOc6cc5C4Cc3c2c1
: