Target
Histone-lysine N-methyltransferase EHMT2
Ligand
BDBM50446376
Substrate
Meas. Tech.
ChEMBL_1617770 (CHEMBL3859839)
IC50
3.3±n/a nM
Citation
 Chen, WLWang, ZHFeng, TTLi, DDWang, CHXu, XLZhang, XJYou, QDGuo, XK Discovery, design and synthesis of 6H-anthra[1,9-cd]isoxazol-6-one scaffold as G9a inhibitor through a combination of shape-based virtual screening and structure-based molecular modification. Bioorg Med Chem 24:6102-6108 (2016)  
Target
Name:
Histone-lysine N-methyltransferase EHMT2
Synonyms:
BAT8 EHMT2 G9A Histone-lysine N-methyltransferase EHMT1/EHMT2 KMT1C Protein G9a (G9a)
Type:
Enzyme
Mol. Mass.:
132339.87
Organism:
Homo sapiens (Human)
Description:
Q96KQ7
Residue:
1210
  
Inhibitor
Name:
BDBM50446376
Synonyms:
CHEMBL3109630
Type:
Small organic molecule
Emp. Form.:
C19H27N3O2
Mol. Mass.:
329.4366
SMILES:
COc1cc2c(cc1OCCCN1CCCC1)N=C(N)C21CCC1
: