Target
ATP-dependent translocase ABCB1
Ligand
BDBM81939
Substrate
Meas. Tech.
ChEMBL_1617830 (CHEMBL3859899)
IC50
65600±n/a nM
Citation
 Schmitt, FDraut, HBiersack, BSchobert, R Halogenated naphthochalcones and structurally related naphthopyrazolines with antitumor activity. Bioorg Med Chem Lett 26:5168-5171 (2016)  
Target
Name:
ATP-dependent translocase ABCB1
Synonyms:
ABCB1 MDR1_HUMAN Multidrug resistance protein 1 P-glycoprotein (P-gp) PGY1
Type:
Protein
Mol. Mass.:
141503.50
Organism:
Homo sapiens (Human)
Description:
P08183
Residue:
1280
  
Inhibitor
Name:
BDBM81939
Synonyms:
CAS_52-53-9 VERAPAMIL
Type:
Small organic molecule
Emp. Form.:
C27H38N2O4
Mol. Mass.:
454.6016
SMILES:
COc1ccc(CCN(C)CCCC(C#N)(C(C)C)c2ccc(OC)c(OC)c2)cc1OC
: