Target
Amine oxidase [flavin-containing] A
Ligand
BDBM29136
Substrate
Meas. Tech.
ChEMBL_1617981 (CHEMBL3860150)
IC50
6600±n/a nM
Citation
 Estrada, MHerrera-Arozamena, CPérez, CViña, DRomero, AMorales-García, JAPérez-Castillo, ARodríguez-Franco, MI New cinnamic - N-benzylpiperidine and cinnamic - N,N-dibenzyl(N-methyl)amine hybrids as Alzheimer-directed multitarget drugs with antioxidant, cholinergic, neuroprotective and neurogenic properties. Eur J Med Chem 121:376-386 (2016)  
Target
Name:
Amine oxidase [flavin-containing] A
Synonyms:
AOFA_HUMAN MAO-A Monoamine oxidase Monoamine oxidase type A (MAO A) Monoamine oxidase type A (MAOA)
Type:
Protein
Mol. Mass.:
59689.53
Organism:
Homo sapiens (Human)
Description:
P21397
Residue:
527
  
Inhibitor
Name:
BDBM29136
Synonyms:
CHEMBL92401 Iprazid | Iproniazid
Type:
Small organic molecule
Emp. Form.:
C9H13N3O
Mol. Mass.:
179.219
SMILES:
CC(C)NNC(=O)c1ccncc1
: