Target
Sortase family protein
Ligand
BDBM50196038
Substrate
Meas. Tech.
ChEMBL_1618140 (CHEMBL3860309)
Ki
42000±n/a nM
Citation
 Rentero Rebollo, IMcCallin, SBertoldo, DEntenza, JMMoreillon, PHeinis, C Development of Potent and Selective S. aureus Sortase A Inhibitors Based on Peptide Macrocycles. ACS Med Chem Lett 7:606-11 (2016)  
Target
Name:
Sortase family protein
Synonyms:
Sortase | Sortase A (SrtA)
Type:
Enzyme
Mol. Mass.:
23546.15
Organism:
Staphylococcus aureus
Description:
Residue:
206
  
Inhibitor
Name:
BDBM50196038
Synonyms:
CHEMBL3940372
Type:
Small organic molecule
Emp. Form.:
C68H106N22O18S3
Mol. Mass.:
1615.901
SMILES:
[H][C@@]12CCCN1C(=O)[C@]1([H])CCCN1C(=O)[C@H](CC(C)C)NC(=O)[C@@H](NC(=O)CNC(=O)[C@H](CCC(N)=O)NC(=O)[C@H](CSCc1cc3CSC[C@H](NC(=O)CNC(=O)CNC(=O)CNC(=O)CNC(=O)[C@H](CCCNC(N)=N)NC(=O)CNC(=O)[C@H](CSCc(c1)c3)NC2=O)C(=O)NCC(N)=O)NC(=O)[C@H](C)N)[C@@H](C)CC
: